{"text_format":"1","workbook":"xlsx","n_sheets":6,"sheets":["Instructions","Self-Assessment","Element Descriptions"," Legacy NG911 Scorecard","Acronyms","Data Backend"],"not_rendered":{"charts":0,"images":4,"macros":1,"external_links":1,"defined_names":7,"comments":2,"pivot_tables":0},"unopened":[],"bounds":{"document_bytes":16777216,"sheet_cells":100000,"rows_first":2000,"rows_last":500,"rows_between":2000,"halvings":0,"cell_chars":16384,"cell_head_chars":4096},"cells_cut":0,"cells_raw":0,"read":"whole","date_system":"1900"}

{"sheet":"Instructions","index":0,"n_rows":64,"n_cols":2,"rows_kept":64,"cut":false,"hidden":false,"merged":[[3,0,3,9]]}
[]
[]
[]
["Next Generation 911 Self-Assessment Tool"]
[]
[null,"Introduction"]
[null,"This Next Generation 911 Self-Assessment Tool enables emergency communications centers (ECCs)/public safety answering points (PSAPs) administrators and oversight personnel to evaluate their center’s NG911 Maturity State. ECC/PSAP administrators and practitioners can use the Tool to strengthen their understanding of NG911 elements, increase their awareness of NG911 maturity continuum position, assist in planning NG911 transition steps, and enable a consistent terminology for NG911 maturity state. "]
[null,"The Tool includes some technical questions which may require collaboration with leadership, technical staff and/or vendors to answer. No tool can detail each ECC/PSAP's implementation exactly, so answers should be an effort to best reflect current implementation and progress. Tool results are for use by the ECC/PSAP completing the questionnaire and are shared only at their discretion."]
[null,"Built on stakeholder feedback from multiple levels of government, industry, and academia, the Tool embodies the work of the SAFECOM-NCSWIC NG911 Working Group members, FCC’s TFOPA, and the National 911 Program."]
[]
[null,"Self-Assessment Tab Instructions"]
[null,"1. After enabling macros, select your organization’s implementation characterization in row 3, noting the following definitions. For federal and academic institutions, select the option that best characterizes your organization:\n    - Regional: All intrastate or interstate organizations that are multi-jurisdictional\n    - State: All state, commonwealth, and territorial organizations\n    - Local: All remaining city, town, county, village, parish, tribal, and municipal organizations"]
[null,"2. For each section (Governance, Architecture, Security):\n    - Click on subsection headings for hyperlinked descriptions:                                                                                                                                                                          "]
[null,"* Governance subsections:Structure Design & Framework, Strategic Planning, Coordination, Funding & Resources"]
[null,"* Architecture subsections:Routing & Location, Geographic Information Systems Data, Next Generation Core Service Elements, Network, PSAP Call Handling System & Applications, Operational Planning, Optional Interfaces"]
[null,"* Security subsections:Identification & Discovery, Assessment & Prioritization, Implementation & Operation, Monitoring &"]
[null,"Evaluation, Testing & Analysis, Improvement & Evolution"]
[null,"3. For each question:"]
[null,"    - Answer question provided in Column B by selecting one of the dropdown options in Column C"]
[null,"    - Hover over any question for more detail if the nature of the question is unclear and additional text may appear"]
{"$rows_left_out":45}
{"sheet":"Self-Assessment","index":1,"n_rows":197,"n_cols":4,"rows_kept":197,"cut":false,"hidden":false,"merged":[[105,0,105,3],[7,0,7,3],[148,0,148,2],[146,0,146,2],[36,0,36,2],[43,0,43,2],[100,0,100,2],[97,0,97,2],[87,0,87,2],[74,0,74,2],[116,0,116,2],[125,0,125,2],[130,0,130,2],[70,0,70,2],[107,0,107,2],[111,0,111,2],[0,0,0,1],[10,0,10,2],[23,0,23,2],[32,0,32,2],[66,0,66,2],[57,0,57,2],[2,2,2,3],[1,2,1,3],[9,0,9,3],[191,0,191,2],[188,0,188,2],[182,0,182,2],[160,0,160,2],[136,0,136,2],[145,1,145,6],[141,0,141,2],[155,0,155,2],[149,0,149,2]]}
[]
[null,null,"Dropdown Options"]
[1,"Please choose the description that best characterizes your ECC/PSAP:","Local: All remaining city, town, county, village, parish, tribal, and municipal organizations"]
[]
[null,null,"Overall Maturity State"]
[null,null,{"$f":"IF(OR(C104=\"Legacy\",C145=\"Legacy\",C197=\"Legacy\"),\"Legacy\",IF(OR(C104=\"Foundational\",C145=\"Foundational\",C197=\"Foundational\"),\"Foundational\",IF(OR(C104=\"Transitional\",C145=\"Transitional\",C197=\"Transitional\"),\"Transitional\",IF(AND(C111=\"Yes, a LIS or its equivalent is implemented with each OSP\",C104=\"Intermediate\",C145=\"Intermediate\",C197=\"Intermediate\"),\"Jurisdictional End State\",IF(AND(C104=\"Intermediate\",C145=\"Intermediate\",C197=\"Intermediate\"),\"Intermediate\",\"#N/A\")))))","v":"#N/A"}]
[]
["Governance"]
[null,null,"Dropdown Options"]
["CHARACTERIZE IF YOUR ORGANIZATION HAS:"]
["State Governance Structure Design & Framework",null,null,"Maturity State"]
[29,{"$f":"'Data Backend'!A3","v":"Established a name, authority, and purpose for a formalized 911 governance body that: a) solidifies the body’s legal standing and purpose; b) indicates its authority and any amendments to prior authorities; and c) confirms any concurrent jurisdictional bounds, if applicable:"},null,{"$f":"IFERROR(INDEX('Data Backend'!$B$4:$B$6,MATCH($C12,'Data Backend'!$A$4:$A$6,0)),\"\")","v":""}]
[30,{"$f":"'Data Backend'!A7","v":"Established the governance body’s oversight authority—including any rule-making authority—aligning activities to overarching strategies and plans, and maintaining fiduciary and fiscal compliance:"},null,{"$f":"IFERROR(INDEX('Data Backend'!$B$8:$B$10,MATCH($C13,'Data Backend'!$A$8:$A$10,0)),\"\")","v":""}]
[31,{"$f":"'Data Backend'!A11","v":"Regulations, a charter, and/or bylaws that build upon the legal authority or set an agreed-upon authority, concurring with all jurisdictions where applicable:"},null,{"$f":"IFERROR(INDEX('Data Backend'!$B$12:$B$14,MATCH($C14,'Data Backend'!$A$12:$A$14,0)),\"\")","v":""}]
[32,{"$f":"'Data Backend'!A15","v":"A reporting mechanism for the governance body to notify the public and all appropriate government agencies/bodies on accomplishments, issues, and future priorities to enhance 911/NG911:"},null,{"$f":"IFERROR(INDEX('Data Backend'!$B$16:$B$18,MATCH($C15,'Data Backend'!$A$16:$A$18,0)),\"\")","v":""}]
[33,{"$f":"'Data Backend'!A19","v":"A membership listing of 911 governance authorities’ representatives:"},null,{"$f":"IFERROR(INDEX('Data Backend'!$B$20:$B$22,MATCH($C16,'Data Backend'!$A$20:$A$22,0)),\"\")","v":""}]
[34,{"$f":"'Data Backend'!A23","v":"Defined roles, responsibilities, and functions (e.g., voting, non-voting, and ex-officio) for members of the governance authority:"},null,{"$f":"IFERROR(INDEX('Data Backend'!$B$24:$B$26,MATCH($C17,'Data Backend'!$A$24:$A$26,0)),\"\")","v":""}]
[35,{"$f":"'Data Backend'!A27","v":"A 911 Administrator (and appropriate support) to execute 911 services (e.g., operations, training, and performance standards):"},null,{"$f":"IFERROR(INDEX('Data Backend'!$B$28:$B$30,MATCH($C18,'Data Backend'!$A$28:$A$30,0)),\"\")","v":""}]
[36,{"$f":"'Data Backend'!A31","v":"An ongoing mechanism to encourage collaboration among NG911 and other public safety governance bodies (e.g., broadband, other jurisdictions) to promote interoperability:"}]
[37,{"$f":"'Data Backend'!A35","v":"A governance authority that collaborates and engages with all applicable Statewide Interoperability Coordinators (SWICS):"}]
{"$rows_left_out":178}
{"sheet":"Element Descriptions","index":2,"n_rows":52,"n_cols":1,"rows_kept":52,"cut":false,"hidden":false,"merged":[]}
["NG911 Self-Assessment Tool"]
["Scorecard Explanation"]
["The NG911 Self-Assessment Tool provides 911 authority stakeholders an understanding of essential elements within each NG911 implementation maturity state (state, regional, and local). With this understanding 911 authority stakeholders can better plan for the technical, operational, and financial needs associated with their NG911 transition.\n\nThe NG911 Self-Assessment Tool is broken down into the following areas of interest:\nGovernance\n  a) Structure Design & Framework     b) Strategic Planning     c) Coordination     d) Funding & Resources\nArchitecture\n  a) Routing & Location     b) Geographic Information Systems Data     c) Next Generation Core Service Elements     d) Network (Originating Service Environments & ESInets)     e) ECC/PSAP Call Handling System and Applications   f) Operational Planning    g) Optional Interfaces\nSecurity\n  a) Identification & Discovery     b) Assessment & Prioritization     c) Implementation & Operation     d) Monitoring & Evaluation     e) Testing & Analysis     f) Improvement & Evolution\n\nEach “area of interest” is broken down by a set of essential elements. The self-assessment elements identify either functional capabilities, architecture implementation, or operational capabilities. Functional and operational capabilities are either defined by legacy 911 capabilities or those capabilities defined by the NENA i3 standard. Architecture implementation is defined by either legacy compatibility or alignment to the NENA i3 standard. Section 4 provides important additional detail on the “areas of interest” under General Considerations, and as it relates to Operational Impacts of NG911.\n\nFor all elements, \"planning\" refers to the preparation for transitioning from Legacy 911 to NG911."]
[]
["Governance"]
["Governance addresses the structured oversight of the 911 authorities and identifies whether there is a governing body with documented and tracked planning and implementation efforts. Coordination indicates whether all participating entities within the jurisdictional scope have agreed upon cooperation and go-forward strategies and plans. Funding and Resources indicate that the funding and resources necessary to execute the NG911 plan have been identified or a strategy is in place to secure those funds and resources at necessary points during the plan execution. Governance structure is ongoing, providing the coordination and administration of the entire NG911 service system after implementation."]
[]
["Architecture"]
["Routing & Location"]
["Routing and location defines the systematic approach that is used to determine 911 call routing and the supporting data functions. Legacy 911 calls are processed by relating the calling telephone number to an Emergency Services Number (ESN) that then defines the primary and secondary ECC/PSAPs. NG911 utilizes geospatial routing by using the caller’s location information and a set of ECC/PSAP jurisdictional polygons to determine the primary ECC/PSAP. A “pure” NG911 implementation assumes OSPs have changed the means by which they deliver 911 calls, but it is not realistic or expected that Originating Service Providers will change together or even all complete their changes any time soon. Therefore, the model is complicated by mechanisms to “transition” from legacy methods to NG911 methods. The legacy ALI DBMS provides location information based on the caller’s telephone number and its equivalent is required until all OSPs deliver location information with their 911 call setup messages or provide LIS capabilities."]
[]
["GIS Data"]
["GIS Data is a fundamental element of NG911 call routing but is not utilized for Legacy 911 call routing. These selection items define steps to plan, process, and utilize GIS data for NG911. Selection items are included that represent the NENA i3 functional elements that receive and utilize GIS data to complete call routing functions. The exchange of jurisdictional boundaries indicates an automated mechanism where an ESInet ECRF (or Forest Guide function) automatically keeps a neighboring ESInet ECRF (or Forest Guide function) updated with its jurisdictional polygons to allow for 911 call hand-offs and call transfers. GIS data is also utilized with NG911 for the validation (LVF) function and to support mapping services for the ECC/PSAPs."]
[]
["NG911 Core Service Elements"]
["The central Core Services functions provide the logical processing interactions between the delivery of calls and data from the OSE, additional data, and delivery to ECC/PSAPs, and provide the features to support management of how the NG911 service accomplishes this under normal and abnormal conditions. NG Core Service Element capabilities are an itemized list of the functional capabilities defined by the NENA i3 architecture."]
[]
["Network (OSE and ESInet)"]
["The network area capabilities represent the various technology mechanisms for connecting external entities to either a legacy selective router or functions within an ESInet for the purposes of processing 911 calls. Legacy call circuit mechanisms are primarily TDM based technology (e.g., SS7, CAMA) and NG911 moves to IP-based technology with application specific protocols such as SIP and RTP. In some cases, IP technology can be deployed as a replacement for a legacy TDM technology before completely embracing the NENA i3 defined functional interface model, such as an OSP using IP technology call delivery to an ESInet IP Selective Router without including a location object representing the caller’s location. E2 Location uses legacy wireless capabilities to retrieve location information and may be required until all OSPs that allow location update transactions deliver callers' location information at call setup time. ESInet to ESInet connections may occur as neighboring jurisdictions implement ESInets and exchange 911 calls and any multimedia or other data in an interoperable fashion."]
[]
{"$rows_left_out":33}
{"sheet":" Legacy NG911 Scorecard","index":3,"n_rows":70,"n_cols":14,"rows_kept":70,"cut":false,"hidden":true,"merged":[[0,0,0,10],[1,1,1,6],[1,8,1,10]]}
["Next Generation 9-1-1 Self-Assessment ScoreCard "]
[null,"NG911 Implementation Maturity State",null,null,null,null,null,null,"NG911 Maturity State Self Assessment"]
["Governance ","Legacy","Foundational","Transitional","Intermediate","i3 End State - Jurisdictional","i3 End State - National",null,"Status","Maintained/Provided by","Notes"]
["Governance Structure Design & Framework","Optional","X","X","X","X","X"]
["Strategic Planning","Optional","Optional","X","X","X","X"]
["Coordination","Optional","Optional","X","X","X","X"]
["Funding & Resources","Optional","X","X","X","X","X"]
["Routing & Location ",null,null,null,null,null,null,null,null,null,null,null,null,"Status Levels"]
["Selective (ESN) Routing","X","X",null,null,null,null,null,null,null,null,null,null,"Planning"]
["IP Selective (ESN) Routing",null,null,"X",null,null,null,null,null,null,null,null,null,"Implementation"]
["Geospatial Routing (utilizing best available location)",null,null,null,"X","X","X",null,null,null,null,null,null,"Complete"]
["ALI DBMS","X","X","X","X"]
["LIS",null,null,null,"Optional","X","X"]
["National Forest Guide contains Jurisdictional ESInet Authoritative Boundary",null,null,null,null,"Optional","X"]
["If applicable, Hierarchical Forest Guides Populated",null,null,null,null,"Optional","X"]
["GIS Data "]
["NG911 Dataset Creation Project Planned",null,"X"]
["NG911 Dataset Creation Project in-Progress",null,"X","Optional"]
["NG911 Dataset Complete",null,null,null,"X","X","X"]
["Data formatted for Location Verification Function (LVF)",null,null,"Optional","Optional","X","X"]
{"$rows_left_out":51}
{"sheet":"Acronyms","index":4,"n_rows":46,"n_cols":2,"rows_kept":46,"cut":false,"hidden":false,"merged":[]}
["Acronym","Term"]
["ALI","Automatic Location Information"]
["BCF","Border Control Function"]
["CAD","Computer-Aided Dispatch"]
["CAMA","Centralized Automatic Message Accounting"]
["CHS","Call Handling System"]
["DBMS","Database Management System"]
["DMZ","Demilitarized Zone"]
["ECC","Emergency Communications Center"]
["ECRF","Emergency Call Routing Function"]
["ESInet","Emergency Services Internet Protocol Network"]
["ESN","Emergency Services Number"]
["ESRP","Emergency Services Routing Proxy"]
["FCC","Federal Communications Commission"]
["FirstNet","First Responder Network Authority"]
["GIS","Geographic Information Systems"]
["LIS","Location Information Server"]
["LMR","Land Mobile Radio"]
["LNG","Legacy Network Gateway"]
["LPG","Legacy Public Safety Answering Point Gateway"]
{"$rows_left_out":27}
{"sheet":"Data Backend","index":5,"n_rows":529,"n_cols":3,"rows_kept":529,"cut":false,"hidden":true,"merged":[[130,4,130,5],[141,4,141,5],[70,0,70,1],[79,0,79,1],[244,0,244,1],[249,0,249,1],[253,0,253,1],[84,0,84,1],[89,0,89,1],[94,0,94,1],[98,0,98,1],[99,0,99,1],[215,0,215,1],[220,0,220,1],[112,0,112,1],[151,0,151,1],[124,4,124,5],[168,0,168,1],[172,0,172,1],[131,0,131,1],[135,0,135,1],[143,0,143,1],[147,0,147,1],[155,0,155,1],[418,0,418,1],[431,0,431,1],[422,0,422,1],[417,0,417,1],[427,0,427,1],[406,0,406,1],[410,0,410,1],[414,0,414,1],[392,0,392,1],[401,0,401,1],[473,0,473,1],[474,0,474,1],[477,0,477,1],[464,0,464,1],[437,0,437,1],[438,0,438,1],[443,0,443,1],[434,0,434,1],[469,0,469,1],[456,0,456,1],[446,0,446,1],[449,0,449,1],[452,0,452,1],[455,0,455,1],[460,0,460,1],[26,0,26,1],[42,0,42,1],[51,0,51,1],[123,0,123,1],[127,0,127,1],[73,0,73,1],[76,0,76,1],[102,0,102,1],[30,0,30,1],[55,0,55,1],[60,0,60,1],[65,0,65,1],[46,0,46,1],[38,0,38,1],[34,0,34,1],[122,0,122,1],[50,0,50,1],[116,0,116,1],[139,0,139,1],[176,0,176,1],[195,0,195,1],[200,0,200,1],[0,0,0,1],[2,0,2,1],[121,0,121,1],[243,0,243,1],[6,0,6,1],[10,0,10,1],[1,0,1,1],[177,0,177,1],[185,0,185,1],[190,0,190,1],[14,0,14,1],[18,0,18,1],[22,0,22,1],[105,0,105,1],[109,0,109,1],[83,0,83,1],[160,0,160,1],[164,0,164,1],[205,0,205,1],[230,0,230,1],[181,0,181,1],[210,0,210,1],[214,0,214,1],[342,0,342,1],[341,0,341,1],[328,0,328,1],[345,0,345,1],[356,0,356,1],[370,0,370,1],[309,0,309,1],[314,0,314,1],[325,0,325,1],[332,0,332,1],[333,0,333,1],[337,0,337,1],[365,0,365,1],[351,0,351,1],[350,0,350,1],[225,0,225,1],[229,0,229,1],[265,0,265,1],[281,0,281,1],[384,0,384,1],[389,0,389,1],[375,0,375,1],[380,0,380,1],[364,0,364,1],[361,0,361,1],[383,0,383,1],[397,0,397,1],[233,0,233,1],[237,0,237,1],[257,0,257,1],[245,0,245,1],[269,0,269,1],[319,0,319,1],[322,0,322,1],[273,0,273,1],[277,0,277,1],[299,0,299,1],[304,0,304,1],[289,0,289,1],[285,0,285,1],[293,0,293,1],[294,0,294,1],[261,0,261,1]]}
["State Governance"]
["Governance Structure Design & Framework",null,"Regional: All intrastate or interstate organizations that are multijurisdictional"]
["Established a name, authority, and purpose for a formalized 911 governance body that: a) solidifies the body’s legal standing and purpose; b) indicates its authority and any amendments to prior authorities; and c) confirms any concurrent jurisdictional bounds, if applicable:",null,"State: All state, commonwealth, and territorial organizations"]
["Planning to develop","Foundational","Local: All remaining city, town, county, village, parish, tribal, and municipal organizations"]
["Developed","Transitional"]
["Implemented and using","Intermediate"]
["Established the governance body’s oversight authority—including any rule-making authority—aligning activities to overarching strategies and plans, and maintaining fiduciary and fiscal compliance:"]
["Planning to develop","Foundational"]
["Developed","Transitional"]
["Implemented and using","Intermediate"]
["Regulations, a charter, and/or bylaws that build upon the legal authority or set an agreed-upon authority, concurring with all jurisdictions where applicable:"]
["Planning to develop","Foundational"]
["Developed","Transitional"]
["Implemented and using","Intermediate"]
["A reporting mechanism for the governance body to notify the public and all appropriate government agencies/bodies on accomplishments, issues, and future priorities to enhance 911/NG911:"]
["Planning to develop","Foundational"]
["Developed","Transitional"]
["Implemented and using","Intermediate"]
["A membership listing of 911 governance authorities’ representatives:"]
["Planning to develop","Foundational"]
{"$rows_left_out":509}